Target
Muscarinic acetylcholine receptor M4
Ligand
BDBM50206180
Substrate
Meas. Tech.
ChEMBL_454684 (CHEMBL886704)
Ki
2000±n/a nM
Citation
 Suckling, CJMurphy, JAKhalaf, AIZhou, SZLizos, DEvan Nhien, ANYasumatsu, HMcVie, AYoung, LCMcCraw, CWaterman, PGMorris, BJPratt, JAHarvey, AL M4 agonists/5HT7 antagonists with potential as antischizophrenic drugs: serominic compounds. Bioorg Med Chem Lett 17:2649-55 (2007)  
Target
Name:
Muscarinic acetylcholine receptor M4
Synonyms:
ACM4_HUMAN Cholinergic, muscarinic M4 Muscarinic acetylcholine receptor M2 and M4
Type:
Enzyme Catalytic Domain
Mol. Mass.:
53079.31
Organism:
Homo sapiens (Human)
Description:
Cholinergic, muscarinic M4 CHRM4 HUMAN M3::P08173
Residue:
479
  
Inhibitor
Name:
BDBM50206180
Synonyms:
9,10-dimethoxy-7-methyl-5,8,13,13a-tetrahydro-6H-[1,3]dioxolo[4,5-g]isoquino[3,2-a]isoquinolin-7-ium | CHEMBL441356
Type:
Small organic molecule
Emp. Form.:
C21H24NO4
Mol. Mass.:
354.419
SMILES:
COc1ccc2CC3c4cc5OCOc5cc4CC[N+]3(C)Cc2c1OC
: