Target
5-hydroxytryptamine receptor 7
Ligand
BDBM50206186
Substrate
Meas. Tech.
ChEMBL_454683 (CHEMBL886703)
Ki
46±n/a nM
Citation
 Suckling, CJMurphy, JAKhalaf, AIZhou, SZLizos, DEvan Nhien, ANYasumatsu, HMcVie, AYoung, LCMcCraw, CWaterman, PGMorris, BJPratt, JAHarvey, AL M4 agonists/5HT7 antagonists with potential as antischizophrenic drugs: serominic compounds. Bioorg Med Chem Lett 17:2649-55 (2007)  
Target
Name:
5-hydroxytryptamine receptor 7
Synonyms:
5-HT-7 5-HT7 5-HT7S 5HT7 HTR7 | Serotonin receptor 7
Type:
G Protein-Coupled Receptor (GPCR)
Mol. Mass.:
53573.08
Organism:
Homo sapiens (Human)
Description:
P34969
Residue:
479
  
Inhibitor
Name:
BDBM50206186
Synonyms:
2-fluoro-6-((2,3,4,9-tetrahydro-1H-pyrido[3,4-b]indol-1-yl)methyl)phenol | CHEMBL241280
Type:
Small organic molecule
Emp. Form.:
C18H17FN2O
Mol. Mass.:
296.3388
SMILES:
Oc1c(F)cccc1CC1NCCc2c1[nH]c1ccccc21
: