Target
5-hydroxytryptamine receptor 7
Ligand
BDBM50206180
Substrate
Meas. Tech.
ChEMBL_454683 (CHEMBL886703)
Ki
5000±n/a nM
Citation
 Suckling, CJMurphy, JAKhalaf, AIZhou, SZLizos, DEvan Nhien, ANYasumatsu, HMcVie, AYoung, LCMcCraw, CWaterman, PGMorris, BJPratt, JAHarvey, AL M4 agonists/5HT7 antagonists with potential as antischizophrenic drugs: serominic compounds. Bioorg Med Chem Lett 17:2649-55 (2007)  
Target
Name:
5-hydroxytryptamine receptor 7
Synonyms:
5-HT-7 5-HT7 5-HT7S 5HT7 HTR7 | Serotonin receptor 7
Type:
G Protein-Coupled Receptor (GPCR)
Mol. Mass.:
53573.08
Organism:
Homo sapiens (Human)
Description:
P34969
Residue:
479
  
Inhibitor
Name:
BDBM50206180
Synonyms:
9,10-dimethoxy-7-methyl-5,8,13,13a-tetrahydro-6H-[1,3]dioxolo[4,5-g]isoquino[3,2-a]isoquinolin-7-ium | CHEMBL441356
Type:
Small organic molecule
Emp. Form.:
C21H24NO4
Mol. Mass.:
354.419
SMILES:
COc1ccc2CC3c4cc5OCOc5cc4CC[N+]3(C)Cc2c1OC
: