Target
Muscarinic acetylcholine receptor M4
Ligand
BDBM50206190
Substrate
Meas. Tech.
ChEMBL_454684 (CHEMBL886704)
Ki
200±n/a nM
Citation
 Suckling, CJMurphy, JAKhalaf, AIZhou, SZLizos, DEvan Nhien, ANYasumatsu, HMcVie, AYoung, LCMcCraw, CWaterman, PGMorris, BJPratt, JAHarvey, AL M4 agonists/5HT7 antagonists with potential as antischizophrenic drugs: serominic compounds. Bioorg Med Chem Lett 17:2649-55 (2007)  
Target
Name:
Muscarinic acetylcholine receptor M4
Synonyms:
ACM4_HUMAN Cholinergic, muscarinic M4 Muscarinic acetylcholine receptor M2 and M4
Type:
Enzyme Catalytic Domain
Mol. Mass.:
53079.31
Organism:
Homo sapiens (Human)
Description:
Cholinergic, muscarinic M4 CHRM4 HUMAN M3::P08173
Residue:
479
  
Inhibitor
Name:
BDBM50206190
Synonyms:
(E)-3-((6,7-dimethoxy-3,4-dihydroisoquinolin-2(1H)-yl)methyleneamino)-6,7,8,9-tetrahydro-5H-benzo[7]annulen-5-yl acetate | CHEMBL392970
Type:
Small organic molecule
Emp. Form.:
C25H30N2O4
Mol. Mass.:
422.5167
SMILES:
COc1cc2CCN(Cc2cc1OC)\C=N\c1ccc2CCCCC(OC(C)=O)c2c1
: