Target
5-hydroxytryptamine receptor 7
Ligand
BDBM50206189
Substrate
Meas. Tech.
ChEMBL_454683 (CHEMBL886703)
Ki
20±n/a nM
Citation
 Suckling, CJMurphy, JAKhalaf, AIZhou, SZLizos, DEvan Nhien, ANYasumatsu, HMcVie, AYoung, LCMcCraw, CWaterman, PGMorris, BJPratt, JAHarvey, AL M4 agonists/5HT7 antagonists with potential as antischizophrenic drugs: serominic compounds. Bioorg Med Chem Lett 17:2649-55 (2007)  
Target
Name:
5-hydroxytryptamine receptor 7
Synonyms:
5-HT-7 5-HT7 5-HT7S 5HT7 HTR7 | Serotonin receptor 7
Type:
G Protein-Coupled Receptor (GPCR)
Mol. Mass.:
53573.08
Organism:
Homo sapiens (Human)
Description:
P34969
Residue:
479
  
Inhibitor
Name:
BDBM50206189
Synonyms:
1-(2-(propylthio)benzyl)-2,3,4,9-tetrahydro-1H-pyrido[3,4-b]indole | CHEMBL241100
Type:
Small organic molecule
Emp. Form.:
C21H24N2S
Mol. Mass.:
336.494
SMILES:
CCCSc1ccccc1CC1NCCc2c1[nH]c1ccccc21
: