Target
5-hydroxytryptamine receptor 7
Ligand
BDBM50206193
Substrate
Meas. Tech.
ChEMBL_454683 (CHEMBL886703)
Ki
1700±n/a nM
Citation
 Suckling, CJMurphy, JAKhalaf, AIZhou, SZLizos, DEvan Nhien, ANYasumatsu, HMcVie, AYoung, LCMcCraw, CWaterman, PGMorris, BJPratt, JAHarvey, AL M4 agonists/5HT7 antagonists with potential as antischizophrenic drugs: serominic compounds. Bioorg Med Chem Lett 17:2649-55 (2007)  
Target
Name:
5-hydroxytryptamine receptor 7
Synonyms:
5-HT-7 5-HT7 5-HT7S 5HT7 HTR7 | Serotonin receptor 7
Type:
G Protein-Coupled Receptor (GPCR)
Mol. Mass.:
53573.08
Organism:
Homo sapiens (Human)
Description:
P34969
Residue:
479
  
Inhibitor
Name:
BDBM50206193
Synonyms:
1-(3-methoxyphenyl)-2,3,4,9-tetrahydro-1H-pyrido[3,4-b]indole | CHEMBL241098
Type:
Small organic molecule
Emp. Form.:
C18H18N2O
Mol. Mass.:
278.3483
SMILES:
COc1cccc(c1)C1NCCc2c1[nH]c1ccccc21
: