Target
D(2) dopamine receptor
Ligand
BDBM50206163
Substrate
Meas. Tech.
ChEMBL_454685 (CHEMBL886705)
Ki
1600±n/a nM
Citation
 Suckling, CJMurphy, JAKhalaf, AIZhou, SZLizos, DEvan Nhien, ANYasumatsu, HMcVie, AYoung, LCMcCraw, CWaterman, PGMorris, BJPratt, JAHarvey, AL M4 agonists/5HT7 antagonists with potential as antischizophrenic drugs: serominic compounds. Bioorg Med Chem Lett 17:2649-55 (2007)  
Target
Name:
D(2) dopamine receptor
Synonyms:
D(2) dopamine receptor DOPAMINE D2 Long DRD2 Dopamine D2 receptor Dopamine D2 receptor (D2R) Dopamine2-like | d2
Type:
Cell-surface receptors
Mol. Mass.:
50647.10
Organism:
Homo sapiens (Human)
Description:
P14416
Residue:
443
  
Inhibitor
Name:
BDBM50206163
Synonyms:
1-(3-Methoxy-benzyl)-2,3,4,9-tetrahydro-1H-beta-carboline CHEMBL319005
Type:
Small organic molecule
Emp. Form.:
C19H20N2O
Mol. Mass.:
292.3749
SMILES:
COc1cccc(CC2NCCc3c2[nH]c2ccccc32)c1
: