Target
Muscarinic acetylcholine receptor M4
Ligand
BDBM50206178
Substrate
Meas. Tech.
ChEMBL_454684 (CHEMBL886704)
Ki
1600±n/a nM
Citation
 Suckling, CJMurphy, JAKhalaf, AIZhou, SZLizos, DEvan Nhien, ANYasumatsu, HMcVie, AYoung, LCMcCraw, CWaterman, PGMorris, BJPratt, JAHarvey, AL M4 agonists/5HT7 antagonists with potential as antischizophrenic drugs: serominic compounds. Bioorg Med Chem Lett 17:2649-55 (2007)  
Target
Name:
Muscarinic acetylcholine receptor M4
Synonyms:
ACM4_HUMAN Cholinergic, muscarinic M4 Muscarinic acetylcholine receptor M2 and M4
Type:
Enzyme Catalytic Domain
Mol. Mass.:
53079.31
Organism:
Homo sapiens (Human)
Description:
Cholinergic, muscarinic M4 CHRM4 HUMAN M3::P08173
Residue:
479
  
Inhibitor
Name:
BDBM50206178
Synonyms:
(E)-6-((3,4-dihydroisoquinolin-2(1H)-yl)methyleneamino)-2,3-dihydro-1H-inden-1-yl acetate | CHEMBL241103
Type:
Small organic molecule
Emp. Form.:
C21H22N2O2
Mol. Mass.:
334.4116
SMILES:
CC(=O)OC1CCc2ccc(cc12)\N=C\N1CCc2ccccc2C1
: