Target
Sigma non-opioid intracellular receptor 1
Ligand
BDBM50206586
Substrate
Meas. Tech.
ChEMBL_428724 (CHEMBL915240)
Ki
0.82±n/a nM
Citation
 Prezzavento, OCampisi, ARonsisvalle, SLi Volti, GMarrazzo, ABramanti, VCannavò, GVanella, LCagnotto, AMennini, TIentile, RRonsisvalle, G Novel sigma receptor ligands: synthesis and biological profile. J Med Chem 50:951-61 (2007)  
Target
Name:
Sigma non-opioid intracellular receptor 1
Synonyms:
OPRS1 SIGMAR1 Sigma non-opioid intracellular receptor 1 Sigma1-receptor Sterol isomerase-like protein
Type:
Protein
Mol. Mass.:
25307.17
Organism:
Cavia porcellus (Guinea pig)
Description:
Q60492
Residue:
223
  
Inhibitor
Name:
BDBM50206586
Synonyms:
CHEMBL225516 | methyl (1R,2S/1S,2R)-2-[(4-benzylpiperidin-1-yl)methyl]-1-(4-chlorophenyl)cyclopropanecarboxylate
Type:
Small organic molecule
Emp. Form.:
C24H28ClNO2
Mol. Mass.:
397.938
SMILES:
COC(=O)C1(CC1CN1CCC(Cc2ccccc2)CC1)c1ccc(Cl)cc1
: