Target
Metabotropic glutamate receptor 5
Ligand
BDBM50207083
Substrate
Meas. Tech.
ChEMBL_454796 (CHEMBL886824)
Ki
2480±n/a nM
Citation
 Kulkarni, SSNewman, AH Design and synthesis of novel heterobiaryl amides as metabotropic glutamate receptor subtype 5 antagonists. Bioorg Med Chem Lett 17:2074-9 (2007)  
Target
Name:
Metabotropic glutamate receptor 5
Synonyms:
GRM5_RAT Grm5 Mglur5 metabotropic glutamate 5/1-C metabotropic glutamate 5a
Type:
Enzyme
Mol. Mass.:
131900.14
Organism:
Rattus norvegicus (Rat)
Description:
P31424
Residue:
1203
  
Inhibitor
Name:
BDBM50207083
Synonyms:
CHEMBL247330 | N-(6-methylpyridin-2-yl)-4-(pyrimidin-2-yl)picolinamide
Type:
Small organic molecule
Emp. Form.:
C16H13N5O
Mol. Mass.:
291.3073
SMILES:
Cc1cccc(NC(=O)c2cc(ccn2)-c2ncccn2)n1
: