Target
Metabotropic glutamate receptor 5
Ligand
BDBM50207085
Substrate
Meas. Tech.
ChEMBL_454796 (CHEMBL886824)
Ki
3070±n/a nM
Citation
 Kulkarni, SSNewman, AH Design and synthesis of novel heterobiaryl amides as metabotropic glutamate receptor subtype 5 antagonists. Bioorg Med Chem Lett 17:2074-9 (2007)  
Target
Name:
Metabotropic glutamate receptor 5
Synonyms:
GRM5_RAT Grm5 Mglur5 metabotropic glutamate 5/1-C metabotropic glutamate 5a
Type:
Enzyme
Mol. Mass.:
131900.14
Organism:
Rattus norvegicus (Rat)
Description:
P31424
Residue:
1203
  
Inhibitor
Name:
BDBM50207085
Synonyms:
1-methyl-N-(6-methylpyridin-2-yl)-1H-imidazole-2-carboxamide | CHEMBL248124
Type:
Small organic molecule
Emp. Form.:
C11H12N4O
Mol. Mass.:
216.2392
SMILES:
Cc1cccc(NC(=O)c2nccn2C)n1
: