Target
Metabotropic glutamate receptor 5
Ligand
BDBM50207078
Substrate
Meas. Tech.
ChEMBL_454796 (CHEMBL886824)
Ki
43±n/a nM
Citation
 Kulkarni, SSNewman, AH Design and synthesis of novel heterobiaryl amides as metabotropic glutamate receptor subtype 5 antagonists. Bioorg Med Chem Lett 17:2074-9 (2007)  
Target
Name:
Metabotropic glutamate receptor 5
Synonyms:
GRM5_RAT Grm5 Mglur5 metabotropic glutamate 5/1-C metabotropic glutamate 5a
Type:
Enzyme
Mol. Mass.:
131900.14
Organism:
Rattus norvegicus (Rat)
Description:
P31424
Residue:
1203
  
Inhibitor
Name:
BDBM50207078
Synonyms:
4-(3,5-Difluorophenyl)-N-(6-methylpyrindin-2-yl)picolinamide CHEMBL397121
Type:
Small organic molecule
Emp. Form.:
C18H13F2N3O
Mol. Mass.:
325.3121
SMILES:
Cc1cccc(NC(=O)c2cc(ccn2)-c2cc(F)cc(F)c2)n1
: