Target
Metabotropic glutamate receptor 5
Ligand
BDBM50186330
Substrate
Meas. Tech.
ChEMBL_454797 (CHEMBL886825)
IC50
5330±n/a nM
Citation
 Kulkarni, SSNewman, AH Design and synthesis of novel heterobiaryl amides as metabotropic glutamate receptor subtype 5 antagonists. Bioorg Med Chem Lett 17:2074-9 (2007)  
Target
Name:
Metabotropic glutamate receptor 5
Synonyms:
GPRC1E GRM5_HUMAN metabotropic glutamate 5 | metabotropic glutamate 5a
Type:
Enzyme
Mol. Mass.:
132484.72
Organism:
Homo sapiens (Human)
Description:
Residue:
1212
  
Inhibitor
Name:
BDBM50186330
Synonyms:
3-cyano-N-(6-methylpyridin-2-yl)benzamide | CHEMBL208927
Type:
Small organic molecule
Emp. Form.:
C14H11N3O
Mol. Mass.:
237.2566
SMILES:
Cc1cccc(NC(=O)c2cccc(c2)C#N)n1
: