Target
Muscarinic acetylcholine receptor M2
Ligand
BDBM50208004
Substrate
Meas. Tech.
ChEMBL_429169 (CHEMBL914425)
Ki
302±n/a nM
Citation
 Peretto, IForlani, RFossati, CGiardina, GAGiardini, AGuala, MLa Porta, EPetrillo, PRadaelli, SRadice, LRaveglia, LFSantoro, EScudellaro, RScarpitta, FBigogno, CMisiano, PDondio, GMRizzi, AArmani, EAmari, GCivelli, MVilletti, GPatacchini, RBergamaschi, MDelcanale, MSalcedo, CFernández, AGImbimbo, BP Discovery of diaryl imidazolidin-2-one derivatives, a novel class of muscarinic M3 selective antagonists (Part 1). J Med Chem 50:1571-83 (2007)  
Target
Name:
Muscarinic acetylcholine receptor M2
Synonyms:
ACM2_HUMAN Cholinergic, muscarinic M2 Muscarinic acetylcholine receptor M2 and M5 | RecName: Full=Muscarinic acetylcholine receptor M2
Type:
GPCR
Mol. Mass.:
51730.61
Organism:
Homo sapiens (Human)
Description:
P08172
Residue:
466
  
Inhibitor
Name:
BDBM50208004
Synonyms:
3-(1-(3-fluorobenzyl)-piperidin-4-yl)-5,5-diphenyl-imidazolidin-2-one | CHEMBL373994
Type:
Small organic molecule
Emp. Form.:
C27H28FN3O
Mol. Mass.:
429.5291
SMILES:
Fc1cccc(CN2CCC(CC2)N2CC(NC2=O)(c2ccccc2)c2ccccc2)c1
: