Target
Chymase
Ligand
BDBM50208222
Substrate
Meas. Tech.
ChEMBL_429291 (CHEMBL915852)
Ki
11±n/a nM
Citation
 Greco, MNHawkins, MJPowell, ETAlmond, HRde Garavilla, LHall, JMinor, LKWang, YCorcoran, TWDi Cera, ECantwell, AMSavvides, SNDamiano, BPMaryanoff, BE Discovery of potent, selective, orally active, nonpeptide inhibitors of human mast cell chymase. J Med Chem 50:1727-30 (2007)  
Target
Name:
Chymase
Synonyms:
Alpha-chymase CMA1_HUMAN CYM Mast cell protease I
Type:
Enzyme
Mol. Mass.:
27340.12
Organism:
Homo sapiens (Human)
Description:
Residue:
247
  
Inhibitor
Name:
BDBM50208222
Synonyms:
(E)-2-(3-chloro-5-fluorostyrylamino)-1-(5-chlorobenzo[b]thiophen-3-yl)-2-oxoethyl(methyl)phosphinic acid | CHEMBL374504
Type:
Small organic molecule
Emp. Form.:
C19H15Cl2FNO3PS
Mol. Mass.:
458.27
SMILES:
CP(O)(=O)C(C(=O)NC=Cc1cc(F)cc(Cl)c1)c1csc2ccc(Cl)cc12
: