Target
Metabotropic glutamate receptor 2
Ligand
BDBM50208764
Substrate
Meas. Tech.
ChEMBL_443349 (CHEMBL893597)
EC50
57000±n/a nM
Citation
 Jørgensen, CGBräuner-Osborne, HNielsen, BKehler, JClausen, RPKrogsgaard-Larsen, PMadsen, U Novel 5-substituted 1-pyrazolol analogues of ibotenic acid: synthesis and pharmacology at glutamate receptors. Bioorg Med Chem 15:3524-38 (2007)  
Target
Name:
Metabotropic glutamate receptor 2
Synonyms:
GPRC1B GRM2_HUMAN Metabotropic glutamate receptor mGlu2 | metabotropic glutamate 2
Type:
Enzyme
Mol. Mass.:
95584.88
Organism:
Homo sapiens (Human)
Description:
Q14416
Residue:
872
  
Inhibitor
Name:
BDBM50208764
Synonyms:
(RS)-2-amino-(5-ethyl-1-hydroxy-4-pyrazolyl)acetic acid | CHEMBL390863
Type:
Small organic molecule
Emp. Form.:
C7H11N3O3
Mol. Mass.:
185.1805
SMILES:
CCc1c(cnn1O)C(N)C(O)=O
: