Target
Metabotropic glutamate receptor 4
Ligand
BDBM50208758
Substrate
Meas. Tech.
ChEMBL_443350 (CHEMBL893598)
EC50
>1000000±n/a nM
Citation
 Jørgensen, CGBräuner-Osborne, HNielsen, BKehler, JClausen, RPKrogsgaard-Larsen, PMadsen, U Novel 5-substituted 1-pyrazolol analogues of ibotenic acid: synthesis and pharmacology at glutamate receptors. Bioorg Med Chem 15:3524-38 (2007)  
Target
Name:
Metabotropic glutamate receptor 4
Synonyms:
GRM4_RAT Grm4 Metabotropic glutamate receptor 4 (mGlu4) mGlu4 metabotropic glutamate 4a
Type:
Enzyme
Mol. Mass.:
101849.79
Organism:
Rattus norvegicus (Rat)
Description:
P31423
Residue:
912
  
Inhibitor
Name:
BDBM50208758
Synonyms:
(RS)-2-amino-[1-hydroxy-5-(3-phenylpropyl)-4-pyrazolyl]acetic acid | CHEMBL437169
Type:
Small organic molecule
Emp. Form.:
C14H17N3O3
Mol. Mass.:
275.3031
SMILES:
NC(C(O)=O)c1cnn(O)c1CCCc1ccccc1
: