Target
Metabotropic glutamate receptor 1
Ligand
BDBM50208757
Substrate
Meas. Tech.
ChEMBL_443346 (CHEMBL893594)
EC50
>1000000±n/a nM
Citation
 Jørgensen, CGBräuner-Osborne, HNielsen, BKehler, JClausen, RPKrogsgaard-Larsen, PMadsen, U Novel 5-substituted 1-pyrazolol analogues of ibotenic acid: synthesis and pharmacology at glutamate receptors. Bioorg Med Chem 15:3524-38 (2007)  
Target
Name:
Metabotropic glutamate receptor 1
Synonyms:
GRM1_RAT Grm1 Metabotropic glutamate receptor Mglur1 metabotropic glutamate 1/5-D metabotropic glutamate receptor 1 isoform alpha precursor
Type:
Enzyme Catalytic Domain
Mol. Mass.:
133240.47
Organism:
RAT
Description:
metabotropic glutamate 1/2 0 RAT::P23385
Residue:
1199
  
Inhibitor
Name:
BDBM50208757
Synonyms:
(RS)-2-amino-(5-cyclohexylmethyl-1-hydroxy-4-pyrazolyl)acetic acid | CHEMBL242344
Type:
Small organic molecule
Emp. Form.:
C12H19N3O3
Mol. Mass.:
253.2976
SMILES:
NC(C(O)=O)c1cnn(O)c1CC1CCCCC1
: