Target
M-phase inducer phosphatase 2
Ligand
BDBM50208827
Substrate
Meas. Tech.
ChEMBL_455153 (CHEMBL887183)
IC50
100±n/a nM
Citation
 Park, HCarr, BILi, MHam, SW Fluorinated NSC as a Cdc25 inhibitor. Bioorg Med Chem Lett 17:2351-4 (2007)  
Target
Name:
M-phase inducer phosphatase 2
Synonyms:
CDC25B Dual specificity phosphatase (CDC25B) M-phase inducer phosphatase 2 (CDC25B) | MPIP2_HUMAN
Type:
Protein
Mol. Mass.:
64985.27
Organism:
Homo sapiens (Human)
Description:
Residue:
580
  
Inhibitor
Name:
BDBM50208827
Synonyms:
2,3-bis(2-hydroxyethylthio)naphthalene-1,4-dione N1786 (NSC95397) NSC 95397 cid_262093
Type:
Small organic molecule
Emp. Form.:
C14H14O4S2
Mol. Mass.:
310.389
SMILES:
OCCSC1=C(SCCO)C(=O)c2ccccc2C1=O
: