Target
Peroxisome proliferator-activated receptor gamma
Ligand
BDBM24566
Substrate
Meas. Tech.
ChEMBL_455158 (CHEMBL887188)
EC50
29000±n/a nM
Citation
 Sauerberg, PMogensen, JPJeppesen, LBury, PSFleckner, JOlsen, GSJeppesen, CBWulff, EMPihera, PHavranek, MPolivka, ZPettersson, I Design of potent PPARalpha agonists. Bioorg Med Chem Lett 17:3198-202 (2007)  
Target
Name:
Peroxisome proliferator-activated receptor gamma
Synonyms:
NR1C3 PPAR-gamma PPARG_HUMAN Peroxisome proliferator-activated receptor gamma (PPAR gamma) Peroxisome proliferator-activated receptor gamma (PPARĪ³) peroxisome proliferator-activated receptor gamma isoform 2
Type:
Nuclear Receptor
Mol. Mass.:
57613.46
Organism:
Homo sapiens (Human)
Description:
P37231
Residue:
505
  
Inhibitor
Name:
BDBM24566
Synonyms:
2-({4-chloro-6-[(2,3-dimethylphenyl)amino]pyrimidin-2-yl}sulfanyl)acetic acid JMC515449 Compound 1 Wyeth 14,643
Type:
Small organic molecule
Emp. Form.:
C14H14ClN3O2S
Mol. Mass.:
323.798
SMILES:
Cc1cccc(Nc2cc(Cl)nc(SCC(O)=O)n2)c1C
: