Target
C-C chemokine receptor type 4
Ligand
BDBM50209279
Substrate
Meas. Tech.
ChEMBL_455257 (CHEMBL906418)
Ki
420±n/a nM
Citation
 Burdi, DFChi, SMattia, KHarrington, CShi, ZChen, SJacutin-Porte, SBennett, RCarson, KYin, WKansra, VGonzalo, JACoyle, AJaffee, BOcain, THodge, MLaRosa, GHarriman, G Small molecule antagonists of the CC chemokine receptor 4 (CCR4). Bioorg Med Chem Lett 17:3141-5 (2007)  
Target
Name:
C-C chemokine receptor type 4
Synonyms:
C-C CKR-4 C-C chemokine receptor type 4 (CCR4) CCR-4 CCR4_HUMAN CMKBR4 | K5-5
Type:
Enzyme
Mol. Mass.:
41406.41
Organism:
Homo sapiens (Human)
Description:
P51679
Residue:
360
  
Inhibitor
Name:
BDBM50209279
Synonyms:
(S)-N-(1-(2-(trifluoromethyl)phenethyl)piperidin-4-yl)-1-(5-chloronaphthalen-2-ylsulfonyl)-N-methylpyrrolidine-2-carboxamide | CHEMBL245931
Type:
Small organic molecule
Emp. Form.:
C30H33ClF3N3O3S
Mol. Mass.:
608.115
SMILES:
CN(C1CCN(CCc2ccccc2C(F)(F)F)CC1)C(=O)[C@@H]1CCCN1S(=O)(=O)c1ccc2c(Cl)cccc2c1
: