Target
cAMP and cAMP-inhibited cGMP 3',5'-cyclic phosphodiesterase 10A
Ligand
BDBM50209525
Substrate
Meas. Tech.
ChEMBL_455270 (CHEMBL886046)
IC50
3±n/a nM
Target
Name:
cAMP and cAMP-inhibited cGMP 3',5'-cyclic phosphodiesterase 10A
Synonyms:
3',5'-cyclic phosphodiesterase PDE10A Phosphodiesterase 10 (PDE10) | Phosphodiesterase 10A
Type:
Protein
Mol. Mass.:
88412.52
Organism:
Homo sapiens (Human)
Description:
Q9Y233
Residue:
1055
  
Inhibitor
Name:
BDBM50209525
Synonyms:
(R)-2-[3-cyano-2-(2'-ethoxy-biphenyl-4-yl)-6-methoxy-quinolin-4-ylamino]-propionic acid | CHEMBL248059
Type:
Small organic molecule
Emp. Form.:
C28H25N3O4
Mol. Mass.:
467.5158
SMILES:
CCOc1ccccc1-c1ccc(cc1)-c1nc2ccc(OC)cc2c(N[C@H](C)C(O)=O)c1C#N
: