Target
cAMP and cAMP-inhibited cGMP 3',5'-cyclic phosphodiesterase 10A
Ligand
BDBM50209536
Substrate
Meas. Tech.
ChEMBL_455270 (CHEMBL886046)
IC50
3±n/a nM
Target
Name:
cAMP and cAMP-inhibited cGMP 3',5'-cyclic phosphodiesterase 10A
Synonyms:
3',5'-cyclic phosphodiesterase PDE10A Phosphodiesterase 10 (PDE10) | Phosphodiesterase 10A
Type:
Protein
Mol. Mass.:
88412.52
Organism:
Homo sapiens (Human)
Description:
Q9Y233
Residue:
1055
  
Inhibitor
Name:
BDBM50209536
Synonyms:
4-[3-cyano-2-(2'-ethoxy-biphenyl-4-yl)-6-fluoro-quinolin-4-ylamino]-butyric acid | CHEMBL393646
Type:
Small organic molecule
Emp. Form.:
C28H24FN3O3
Mol. Mass.:
469.5069
SMILES:
CCOc1ccccc1-c1ccc(cc1)-c1nc2ccc(F)cc2c(NCCCC(O)=O)c1C#N
: