Target
Plasmepsin II
Ligand
BDBM50209553
Substrate
Meas. Tech.
ChEMBL_438604 (CHEMBL887761)
Ki
0.2±n/a nM
Citation
 Hidaka, KKimura, TTsuchiya, YKamiya, MRuben, AJFreire, EHayashi, YKiso, Y Additional interaction of allophenylnorstatine-containing tripeptidomimetics with malarial aspartic protease plasmepsin II. Bioorg Med Chem Lett 17:3048-52 (2007)  
Target
Name:
Plasmepsin II
Synonyms:
Aspartic hemoglobinase II PLM2_PLAFX Plasmepsin 2 Plasmepsin-II
Type:
Enzyme
Mol. Mass.:
51482.09
Organism:
Plasmodium falciparum
Description:
P46925
Residue:
453
  
Inhibitor
Name:
BDBM50209553
Synonyms:
(R)-N-((1S,2R)-2-hydroxy-2,3-dihydro-1H-inden-1-yl)-3-((2S,3S)-2-hydroxy-3-((R)-3-(methylthio)-2-(2-o-tolylacetamido)propanamido)-4-phenylbutanoyl)-5,5-dimethylthiazolidine-4-carboxamide KNI-10232
Type:
Small organic molecule
Emp. Form.:
C38H46N4O6S2
Mol. Mass.:
718.925
SMILES:
CSC[C@H](NC(=O)Cc1ccccc1C)C(=O)N[C@@H](Cc1ccccc1)[C@H](O)C(=O)N1CSC(C)(C)[C@H]1C(=O)N[C@@H]1[C@H](O)Cc2ccccc12
: