Target
5-hydroxytryptamine receptor 7
Ligand
BDBM78940
Substrate
Ki
0.7±n/a nM
Comments
PDSP_1219
Citation
 Lovenberg, TWBaron, BMde Lecea, LMiller, JDProsser, RARea, MAFoye, PERacke, MSlone, ALSiegel, BW A novel adenylyl cyclase-activating serotonin receptor (5-HT7) implicated in the regulation of mammalian circadian rhythms. Neuron 11:449-58 (1993)  
Target
Name:
5-hydroxytryptamine receptor 7
Synonyms:
5-HT-7 5-HT7 5-HT7S 5-hydroxytryptamine receptor 7 5HT7R_RAT GPRFO Serotonin (5-HT) receptor | Serotonin Receptor 7
Type:
G Protein-Coupled Receptor (GPCR)
Mol. Mass.:
49852.62
Organism:
Rattus norvegicus (rat)
Description:
Rat cloned 5-HT7R.
Residue:
448
  
Inhibitor
Name:
BDBM78940
Synonyms:
METHIOTHEPIN Methiothepin mesylate salt cid_3039995 methanesulfonic acid;1-methyl-4-(3-methylsulfanyl-5,6-dihydrobenzo[b][1]benzothiepin-5-yl)piperazine | methanesulfonic acid;1-methyl-4-[3-(methylthio)-5,6-dihydrobenzo[b][1]benzothiepin-5-yl]piperazine
Type:
Small organic molecule
Emp. Form.:
C20H24N2S2
Mol. Mass.:
356.548
SMILES:
CSc1ccc2Sc3ccccc3CC(N3CCN(C)CC3)c2c1
: