Target
P2Y purinoceptor 14
Ligand
BDBM50209667
Substrate
Meas. Tech.
ChEMBL_434326 (CHEMBL917907)
EC50
420±n/a nM
Citation
 Ko, HFricks, IIvanov, AAHarden, TKJacobson, KA Structure-activity relationship of uridine 5'-diphosphoglucose analogues as agonists of the human P2Y14 receptor. J Med Chem 50:2030-9 (2007)  
Target
Name:
P2Y purinoceptor 14
Synonyms:
GPR105 KIAA0001 P2Y14_HUMAN | Purinergic receptor P2Y14
Type:
PROTEIN
Mol. Mass.:
38991.62
Organism:
Homo sapiens (Human)
Description:
ChEMBL_1502487
Residue:
338
  
Inhibitor
Name:
BDBM50209667
Synonyms:
CHEMBL387520 | diphosphoric acid 1-alpha-D-glucopyranosuronic acid 2-((2'-thio)uridin-5''-yl)ester
Type:
Small organic molecule
Emp. Form.:
C15H22N2O17P2S
Mol. Mass.:
596.351
SMILES:
O[C@@H]1[C@@H](COP(O)(=O)OP(O)(=O)O[C@H]2O[C@@H]([C@@H](O)[C@H](O)[C@H]2O)C(O)=O)O[C@H]([C@@H]1O)n1ccc(=O)[nH]c1=S
: