Target
P2Y purinoceptor 14
Ligand
BDBM50197974
Substrate
Meas. Tech.
ChEMBL_434326 (CHEMBL917907)
EC50
810±n/a nM
Citation
 Ko, HFricks, IIvanov, AAHarden, TKJacobson, KA Structure-activity relationship of uridine 5'-diphosphoglucose analogues as agonists of the human P2Y14 receptor. J Med Chem 50:2030-9 (2007)  
Target
Name:
P2Y purinoceptor 14
Synonyms:
GPR105 KIAA0001 P2Y14_HUMAN | Purinergic receptor P2Y14
Type:
PROTEIN
Mol. Mass.:
38991.62
Organism:
Homo sapiens (Human)
Description:
ChEMBL_1502487
Residue:
338
  
Inhibitor
Name:
BDBM50197974
Synonyms:
udp-N-acetyl-glucosamine
Type:
Small organic molecule
Emp. Form.:
C17H25N3O17P2
Mol. Mass.:
605.3389
SMILES:
CC(=O)N[C@H]1[C@H](O)[C@@H](O)[C@H](CO)O[C@H]1OP([O-])(=O)OP([O-])(=O)OC[C@H]1O[C@H]([C@H](O)[C@@H]1O)n1ccc(=O)[nH]c1=O
: