Target
Tissue-type plasminogen activator
Ligand
BDBM50206985
Substrate
Meas. Tech.
ChEMBL_455371 (CHEMBL886146)
IC50
>25100±n/a nM
Citation
 Young, RJBrown, DBurns-Kurtis, CLChan, CConvery, MAHubbard, JAKelly, HAPateman, AJPatikis, ASenger, SShah, GPToomey, JRWatson, NSZhou, P Selective and dual action orally active inhibitors of thrombin and factor Xa. Bioorg Med Chem Lett 17:2927-30 (2007)  
Target
Name:
Tissue-type plasminogen activator
Synonyms:
Alteplase Reteplase Thrombin receptor protein Tissue-type plasminogen activator (tPA) t-PA t-plasminogen activator
Type:
Enzyme
Mol. Mass.:
62931.08
Organism:
Homo sapiens (Human)
Description:
Residue:
562
  
Inhibitor
Name:
BDBM50206985
Synonyms:
2-(5-CHLORO-2-THIENYL)-N-{(3S)-1-[(1S)-1-METHYL-2-MORPHOLIN-4-YL-2-OXOETHYL]-2-OXOPYRROLIDIN-3-YL}ETHANESULFONAMIDE CHEMBL391737
Type:
Small organic molecule
Emp. Form.:
C17H24ClN3O5S2
Mol. Mass.:
449.973
SMILES:
C[C@H](N1CC[C@H](NS(=O)(=O)CCc2ccc(Cl)s2)C1=O)C(=O)N1CCOCC1
: