Target
Vitamin K-dependent protein C
Ligand
BDBM50206984
Substrate
Meas. Tech.
ChEMBL_455367 (CHEMBL886142)
IC50
>25100±n/a nM
Citation
 Young, RJBrown, DBurns-Kurtis, CLChan, CConvery, MAHubbard, JAKelly, HAPateman, AJPatikis, ASenger, SShah, GPToomey, JRWatson, NSZhou, P Selective and dual action orally active inhibitors of thrombin and factor Xa. Bioorg Med Chem Lett 17:2927-30 (2007)  
Target
Name:
Vitamin K-dependent protein C
Synonyms:
Activated protein C cofactor Apolipoprotein H Blood coagulation factor XIV Coagulation factor V heavy chain Endothelial protein C receptor PROC_HUMAN Vitamin K-dependent protein C precursor
Type:
Enzyme
Mol. Mass.:
52067.73
Organism:
Homo sapiens (Human)
Description:
Residue:
461
  
Inhibitor
Name:
BDBM50206984
Synonyms:
(2R)-2-(5-CHLORO-2-THIENYL)-N-{(3S)-1-[(1S)-1-METHYL-2-MORPHOLIN-4-YL-2-OXOETHYL]-2-OXOPYRROLIDIN-3-YL}PROPENE-1-SULFONAMIDE 2-(5-chlorothiophen-2-yl)-N-((S)-1-((S)-1-morpholino-1-oxopropan-2-yl)-2-oxopyrrolidin-3-yl)prop-1-ene-1-sulfonamide | CHEMBL391640
Type:
Small organic molecule
Emp. Form.:
C18H24ClN3O5S2
Mol. Mass.:
461.983
SMILES:
C[C@H](N1CC[C@H](NS(=O)(=O)\C=C(/C)c2ccc(Cl)s2)C1=O)C(=O)N1CCOCC1
: