Target
Dipeptidyl peptidase 9
Ligand
BDBM11160
Substrate
Meas. Tech.
ChEMBL_444120 (CHEMBL893279)
IC50
>100000±n/a nM
Citation
 Kim, DKowalchick, JEEdmondson, SDMastracchio, AXu, JEiermann, GJLeiting, BWu, JKPryor, KDPatel, RAHe, HLyons, KAThornberry, NAWeber, AE Triazolopiperazine-amides as dipeptidyl peptidase IV inhibitors: close analogs of JANUVIA (sitagliptin phosphate). Bioorg Med Chem Lett 17:3373-7 (2007)  
Target
Name:
Dipeptidyl peptidase 9
Synonyms:
DPP9 DPRP-2 Dipeptidyl peptidase 9 (DDP9) Dipeptidyl peptidase 9 (DPP9) Dipeptidyl peptidase IX Dipeptidyl peptidase-like protein 9
Type:
Enzyme
Mol. Mass.:
98260.70
Organism:
Homo sapiens (Human)
Description:
Q86TI2
Residue:
863
  
Inhibitor
Name:
BDBM11160
Synonyms:
(3R)-3-amino-4-(2,5-difluorophenyl)-1-[3-(trifluoromethyl)-5H,6H,7H,8H-[1,2,4]triazolo[3,4-a]pyrazin-7-yl]butan-1-one hydrochloride Triazolopiperazine Analogue 25
Type:
Small organic molecule
Emp. Form.:
C16H16F5N5O
Mol. Mass.:
389.3232
SMILES:
N[C@@H](CC(=O)N1CCn2c(C1)nnc2C(F)(F)F)Cc1cc(F)ccc1F
: