Target
Mitogen-activated protein kinase 10
Ligand
BDBM50211297
Substrate
Meas. Tech.
ChEMBL_459041 (CHEMBL925133)
IC50
500±n/a nM
Citation
 Ijjaali, IPetitet, FDubus, EBarberan, OMichel, A Assessing potency of c-Jun N-terminal kinase 3 (JNK3) inhibitors using 2D molecular descriptors and binary QSAR methodology. Bioorg Med Chem 15:4256-64 (2007)  
Target
Name:
Mitogen-activated protein kinase 10
Synonyms:
JNK3 MAP kinase p49 3F12 MK10_HUMAN Mitogen-activated protein kinase 10 (Stress-activated protein kinase JNK3) (c-Jun N-terminal kinase 3) (MAP kinase p49 3F12) PRKM10 Stress-activated protein kinase JNK3 | c-Jun N-terminal kinase 3 (JNK3)
Type:
Enzyme
Mol. Mass.:
52586.89
Organism:
Homo sapiens (Human)
Description:
Residue:
464
  
Inhibitor
Name:
BDBM50211297
Synonyms:
11-(3,5-bis(sulfooxy)phenyl)undecan-4-yl 2,4-dihydroxy-6-undecylbenzoate | CHEMBL254858
Type:
Small organic molecule
Emp. Form.:
C35H54O12S2
Mol. Mass.:
730.926
SMILES:
CCCCCCCCCCCc1cc(O)cc(O)c1C(=O)OC(CCC)CCCCCCCc1cc(OS(O)(=O)=O)cc(OS(O)(=O)=O)c1
: