Target
Mitogen-activated protein kinase 10
Ligand
BDBM50158551
Substrate
Meas. Tech.
ChEMBL_459041 (CHEMBL925133)
IC50
150±n/a nM
Citation
 Ijjaali, IPetitet, FDubus, EBarberan, OMichel, A Assessing potency of c-Jun N-terminal kinase 3 (JNK3) inhibitors using 2D molecular descriptors and binary QSAR methodology. Bioorg Med Chem 15:4256-64 (2007)  
Target
Name:
Mitogen-activated protein kinase 10
Synonyms:
JNK3 MAP kinase p49 3F12 MK10_HUMAN Mitogen-activated protein kinase 10 (Stress-activated protein kinase JNK3) (c-Jun N-terminal kinase 3) (MAP kinase p49 3F12) PRKM10 Stress-activated protein kinase JNK3 | c-Jun N-terminal kinase 3 (JNK3)
Type:
Enzyme
Mol. Mass.:
52586.89
Organism:
Homo sapiens (Human)
Description:
Residue:
464
  
Inhibitor
Name:
BDBM50158551
Synonyms:
CHEMBL383955 N-5-4-1H-benzo[d][1,2,3]triazol-1-yl)piperidin-1-ylsulfonyl)thiophen-2-yl)methyl)-4-chlorobenzamide
Type:
Small organic molecule
Emp. Form.:
C23H22ClN5O3S2
Mol. Mass.:
516.035
SMILES:
Clc1ccc(cc1)C(=O)NCc1ccc(s1)S(=O)(=O)N1CCC(CC1)n1nnc2ccccc12
: