Target
Mitogen-activated protein kinase 10
Ligand
BDBM50211298
Substrate
Meas. Tech.
ChEMBL_459041 (CHEMBL925133)
IC50
52±n/a nM
Citation
 Ijjaali, IPetitet, FDubus, EBarberan, OMichel, A Assessing potency of c-Jun N-terminal kinase 3 (JNK3) inhibitors using 2D molecular descriptors and binary QSAR methodology. Bioorg Med Chem 15:4256-64 (2007)  
Target
Name:
Mitogen-activated protein kinase 10
Synonyms:
JNK3 MAP kinase p49 3F12 MK10_HUMAN Mitogen-activated protein kinase 10 (Stress-activated protein kinase JNK3) (c-Jun N-terminal kinase 3) (MAP kinase p49 3F12) PRKM10 Stress-activated protein kinase JNK3 | c-Jun N-terminal kinase 3 (JNK3)
Type:
Enzyme
Mol. Mass.:
52586.89
Organism:
Homo sapiens (Human)
Description:
Residue:
464
  
Inhibitor
Name:
BDBM50211298
Synonyms:
CHEMBL400054 | N-(3-(benzo[b]thiophen-2-yl)-1H-indazol-5-yl)-tetrahydrofuran-3-carboxamide
Type:
Small organic molecule
Emp. Form.:
C20H17N3O2S
Mol. Mass.:
363.433
SMILES:
O=C(Nc1ccc2[nH]nc(-c3cc4ccccc4s3)c2c1)C1CCOC1
: