Target
Mitogen-activated protein kinase 10
Ligand
BDBM16017
Substrate
Meas. Tech.
ChEMBL_459041 (CHEMBL925133)
IC50
590±n/a nM
Citation
 Ijjaali, IPetitet, FDubus, EBarberan, OMichel, A Assessing potency of c-Jun N-terminal kinase 3 (JNK3) inhibitors using 2D molecular descriptors and binary QSAR methodology. Bioorg Med Chem 15:4256-64 (2007)  
Target
Name:
Mitogen-activated protein kinase 10
Synonyms:
JNK3 MAP kinase p49 3F12 MK10_HUMAN Mitogen-activated protein kinase 10 (Stress-activated protein kinase JNK3) (c-Jun N-terminal kinase 3) (MAP kinase p49 3F12) PRKM10 Stress-activated protein kinase JNK3 | c-Jun N-terminal kinase 3 (JNK3)
Type:
Enzyme
Mol. Mass.:
52586.89
Organism:
Homo sapiens (Human)
Description:
Residue:
464
  
Inhibitor
Name:
BDBM16017
Synonyms:
4-(2,7-phenanthrolin-9-yl)phenol CHEMBL248643 | phenantroline compound 3
Type:
Small organic molecule
Emp. Form.:
C18H12N2O
Mol. Mass.:
272.3007
SMILES:
Oc1ccc(cc1)-c1cnc2ccc3ccncc3c2c1
: