Target
Melanocyte-stimulating hormone receptor
Ligand
BDBM50211389
Substrate
Meas. Tech.
ChEMBL_434963 (CHEMBL919364)
IC50
430±n/a nM
Citation
 Bednarek, MAMacNeil, TTang, RFong, TMCabello, MAMaroto, MTeran, A Potent and selective agonists of human melanocortin receptor 5: cyclic analogues of alpha-melanocyte-stimulating hormone. J Med Chem 50:2520-6 (2007)  
Target
Name:
Melanocyte-stimulating hormone receptor
Synonyms:
MC1-R MSH-R MSHR_HUMAN Melanocortin receptor (M1 and M4) Melanocortin receptor 1 (MC1-R) | Melanocortin receptor 1 (MC1R)
Type:
Enzyme
Mol. Mass.:
34717.23
Organism:
Homo sapiens (Human)
Description:
Q01726
Residue:
317
  
Inhibitor
Name:
BDBM50211389
Synonyms:
Ac-Nle4-cyclo(Asp5-His6-D-Tyr(Et)-Pro8-Trp9-Lys10)-NH2 | CHEMBL376614
Type:
Small organic molecule
Emp. Form.:
C51H68N12O10
Mol. Mass.:
1009.16
SMILES:
CCCC[C@H](NC(C)=O)C(=O)N[C@H]1CC(=O)NCCCC[C@H](NC(=O)[C@H](Cc2cc3ccccc3[nH]2)NC(=O)[C@@H]2CCCN2C(=O)[C@@H](Cc2ccc(O)cc2)N(CC)C(=O)[C@H](Cc2cnc[nH]2)NC1=O)C(N)=O
: