Target
Melanocyte-stimulating hormone receptor
Ligand
BDBM50211374
Substrate
Meas. Tech.
ChEMBL_434963 (CHEMBL919364)
IC50
710±n/a nM
Citation
 Bednarek, MAMacNeil, TTang, RFong, TMCabello, MAMaroto, MTeran, A Potent and selective agonists of human melanocortin receptor 5: cyclic analogues of alpha-melanocyte-stimulating hormone. J Med Chem 50:2520-6 (2007)  
Target
Name:
Melanocyte-stimulating hormone receptor
Synonyms:
MC1-R MSH-R MSHR_HUMAN Melanocortin receptor (M1 and M4) Melanocortin receptor 1 (MC1-R) | Melanocortin receptor 1 (MC1R)
Type:
Enzyme
Mol. Mass.:
34717.23
Organism:
Homo sapiens (Human)
Description:
Q01726
Residue:
317
  
Inhibitor
Name:
BDBM50211374
Synonyms:
CHEMBL2371967 | c-Nle4-cyclo(Asp5-Tic6-D-4,4'-Bip7-Pip8-Trp9-Lys10)-NH2
Type:
Small organic molecule
Emp. Form.:
C60H72N10O9
Mol. Mass.:
1077.2753
SMILES:
[H][C@@]12CCCCN1C(=O)[C@H](Cc1ccc(cc1)-c1ccccc1)NC(=O)[C@]1([H])Cc3ccccc3CN1C(=O)[C@H](CC(=O)NCCCC[C@H](NC(=O)[C@H](Cc1c[nH]c3ccccc13)NC2=O)C(N)=O)NC(=O)[C@H](CCCC)NC(C)=O
: