Target
Melanocortin receptor 5
Ligand
BDBM50211375
Substrate
Meas. Tech.
ChEMBL_434966 (CHEMBL919367)
IC50
5.90±n/a nM
Citation
 Bednarek, MAMacNeil, TTang, RFong, TMCabello, MAMaroto, MTeran, A Potent and selective agonists of human melanocortin receptor 5: cyclic analogues of alpha-melanocyte-stimulating hormone. J Med Chem 50:2520-6 (2007)  
Target
Name:
Melanocortin receptor 5
Synonyms:
MC-2 MC5R Melanocortin MC5 Melanocortin receptor 5 | Melanocortin receptor 5 (MC5R)
Type:
Enzyme
Mol. Mass.:
36612.92
Organism:
Homo sapiens (Human)
Description:
P33032
Residue:
325
  
Inhibitor
Name:
BDBM50211375
Synonyms:
Ac-Nle4-cyclo(Asp5-His6-D-4,4'-Bip7-Pip8-Trp9-Lys10)-NH2 | CHEMBL2371962
Type:
Small organic molecule
Emp. Form.:
C56H70N12O9
Mol. Mass.:
1055.23
SMILES:
[H][C@@]12CCCCN1C(=O)[C@H](Cc1ccc(cc1)-c1ccccc1)NC(=O)[C@H](Cc1c[nH]cn1)NC(=O)[C@H](CC(=O)NCCCC[C@H](NC(=O)[C@H](Cc1c[nH]c3ccccc13)NC2=O)C(N)=O)NC(=O)[C@H](CCCC)NC(C)=O
: