Target
Beta-2 adrenergic receptor
Ligand
BDBM50213113
Substrate
Meas. Tech.
ChEMBL_436827 (CHEMBL905129)
Ki
100000±n/a nM
Citation
 Jozwiak, KKhalid, CTanga, MJBerzetei-Gurske, IJimenez, LKozocas, JAWoo, AZhu, WXiao, RPAbernethy, DRWainer, IW Comparative molecular field analysis of the binding of the stereoisomers of fenoterol and fenoterol derivatives to the beta2 adrenergic receptor. J Med Chem 50:2903-15 (2007)  
Target
Name:
Beta-2 adrenergic receptor
Synonyms:
ADRB2 ADRB2_HUMAN Beta-2 adrenoceptor | Beta-2 adrenoreceptor
Type:
Mol. Mass.:
46461.69
Organism:
Homo sapiens (Human)
Description:
P07550
Residue:
413
  
Inhibitor
Name:
BDBM50213113
Synonyms:
(S,R)-(+)-5-[1-hydroxy-2-(1-methylhexylamino)ethyl]-1,3-benzenediol US10617654, Compound (S,R)-6
Type:
Small organic molecule
Emp. Form.:
C14H23NO3
Mol. Mass.:
253.3373
SMILES:
CCCC[C@@H](C)NC[C@@H](O)c1cc(O)cc(O)c1
: