Target
Beta-1 adrenergic receptor
Ligand
BDBM50213096
Substrate
Meas. Tech.
ChEMBL_436826 (CHEMBL905128)
Ki
34700±n/a nM
Citation
 Jozwiak, KKhalid, CTanga, MJBerzetei-Gurske, IJimenez, LKozocas, JAWoo, AZhu, WXiao, RPAbernethy, DRWainer, IW Comparative molecular field analysis of the binding of the stereoisomers of fenoterol and fenoterol derivatives to the beta2 adrenergic receptor. J Med Chem 50:2903-15 (2007)  
Target
Name:
Beta-1 adrenergic receptor
Synonyms:
ADRB1R, B1AR Adrb1 Adrenergic receptor beta Beta-1 adrenoreceptor adrenergic Beta1,2
Type:
Protein
Mol. Mass.:
50486.84
Organism:
Rattus norvegicus (Rat)
Description:
P18090
Residue:
466
  
Inhibitor
Name:
BDBM50213096
Synonyms:
(S,R)-(+)-5-{1-hydroxy-2-[1-methyl-2-(1-naphthyl)ethylamino]ethyl}-1,3-benzenediol US10617654, Compound (S,R)-5 US9492405, 38
Type:
Small organic molecule
Emp. Form.:
C21H23NO3
Mol. Mass.:
337.4122
SMILES:
C[C@H](Cc1cccc2ccccc12)NC[C@@H](O)c1cc(O)cc(O)c1
: