Target
Beta-1 adrenergic receptor
Ligand
BDBM50213097
Substrate
Meas. Tech.
ChEMBL_436826 (CHEMBL905128)
Ki
33400±n/a nM
Citation
 Jozwiak, KKhalid, CTanga, MJBerzetei-Gurske, IJimenez, LKozocas, JAWoo, AZhu, WXiao, RPAbernethy, DRWainer, IW Comparative molecular field analysis of the binding of the stereoisomers of fenoterol and fenoterol derivatives to the beta2 adrenergic receptor. J Med Chem 50:2903-15 (2007)  
Target
Name:
Beta-1 adrenergic receptor
Synonyms:
ADRB1R, B1AR Adrb1 Adrenergic receptor beta Beta-1 adrenoreceptor adrenergic Beta1,2
Type:
Protein
Mol. Mass.:
50486.84
Organism:
Rattus norvegicus (Rat)
Description:
P18090
Residue:
466
  
Inhibitor
Name:
BDBM50213097
Synonyms:
(S,R)-(+)-1-p-methoxyphenyl-2-(beta-3',5'-dihydroxyphenyl-beta-oxy)ethylaminopropane US10617654, Compound (S,R)-2 | US9249163, 34
Type:
Small organic molecule
Emp. Form.:
C18H23NO4
Mol. Mass.:
317.3795
SMILES:
COc1ccc(C[C@@H](C)NC[C@@H](O)c2cc(O)cc(O)c2)cc1
: