Target
Beta-1 adrenergic receptor
Ligand
BDBM50213121
Substrate
Meas. Tech.
ChEMBL_436826 (CHEMBL905128)
Ki
52200±n/a nM
Citation
 Jozwiak, KKhalid, CTanga, MJBerzetei-Gurske, IJimenez, LKozocas, JAWoo, AZhu, WXiao, RPAbernethy, DRWainer, IW Comparative molecular field analysis of the binding of the stereoisomers of fenoterol and fenoterol derivatives to the beta2 adrenergic receptor. J Med Chem 50:2903-15 (2007)  
Target
Name:
Beta-1 adrenergic receptor
Synonyms:
ADRB1R, B1AR Adrb1 Adrenergic receptor beta Beta-1 adrenoreceptor adrenergic Beta1,2
Type:
Protein
Mol. Mass.:
50486.84
Organism:
Rattus norvegicus (Rat)
Description:
P18090
Residue:
466
  
Inhibitor
Name:
BDBM50213121
Synonyms:
(S)-(+)-5-(1-hydroxy-2-phenethylaminoethyl)-1,3-benzenediol US10617654, Compound (S)-7 US9492405, (S)-7 | US9492405, 26
Type:
Small organic molecule
Emp. Form.:
C16H19NO3
Mol. Mass.:
273.327
SMILES:
O[C@H](CNCCc1ccccc1)c1cc(O)cc(O)c1
: