Target
Cannabinoid receptor 2
Ligand
BDBM50213137
Substrate
Meas. Tech.
ChEMBL_447434 (CHEMBL896458)
Ki
140±n/a nM
Citation
 Worm, KZhou, QJStabley, GJDeHaven, RNDolle, RE Biaryl cannabinoid mimetics--synthesis and structure-activity relationship. Bioorg Med Chem Lett 17:3652-6 (2007)  
Target
Name:
Cannabinoid receptor 2
Synonyms:
CANNABINOID CB2 CB2 CB2B CNR2_HUMAN Cannabinoid CB2 receptor Cannabinoid receptor 2 (CB2R) | hCB2
Type:
G Protein-Coupled Receptor (GPCR)
Mol. Mass.:
39690.94
Organism:
Homo sapiens (Human)
Description:
P34972
Residue:
360
  
Inhibitor
Name:
BDBM50213137
Synonyms:
4-(2-hydroxy-3',5'-dimethyl-biphenyl-4-yl)-4-methyl-pentanoic acid methylamide | CHEMBL234842
Type:
Small organic molecule
Emp. Form.:
C21H27NO2
Mol. Mass.:
325.4446
SMILES:
CNC(=O)CCC(C)(C)c1ccc(c(O)c1)-c1cc(C)cc(C)c1
: