Target
Cannabinoid receptor 1
Ligand
BDBM50213144
Substrate
Meas. Tech.
ChEMBL_447433 (CHEMBL896457)
Ki
370±n/a nM
Citation
 Worm, KZhou, QJStabley, GJDeHaven, RNDolle, RE Biaryl cannabinoid mimetics--synthesis and structure-activity relationship. Bioorg Med Chem Lett 17:3652-6 (2007)  
Target
Name:
Cannabinoid receptor 1
Synonyms:
CANN6 CB-R CNR CNR1_HUMAN Cannabinoid receptor Cannabinoid receptor 1 (brain)
Type:
G Protein-Coupled Receptor (GPCR)
Mol. Mass.:
52868.96
Organism:
Homo sapiens (Human)
Description:
P21554
Residue:
472
  
Inhibitor
Name:
BDBM50213144
Synonyms:
CHEMBL233184 | morpholin-4-yl-acetic acid 4-(1,1-dimethyl-heptyl)-3',5'-dimethyl-biphenyl-2-ylmethyl ester
Type:
Small organic molecule
Emp. Form.:
C30H43NO3
Mol. Mass.:
465.6673
SMILES:
CCCCCCC(C)(C)c1ccc(c(COC(=O)CN2CCOCC2)c1)-c1cc(C)cc(C)c1
: