Target
Cannabinoid receptor 2
Ligand
BDBM50213151
Substrate
Meas. Tech.
ChEMBL_447434 (CHEMBL896458)
Ki
14±n/a nM
Citation
 Worm, KZhou, QJStabley, GJDeHaven, RNDolle, RE Biaryl cannabinoid mimetics--synthesis and structure-activity relationship. Bioorg Med Chem Lett 17:3652-6 (2007)  
Target
Name:
Cannabinoid receptor 2
Synonyms:
CANNABINOID CB2 CB2 CB2B CNR2_HUMAN Cannabinoid CB2 receptor Cannabinoid receptor 2 (CB2R) | hCB2
Type:
G Protein-Coupled Receptor (GPCR)
Mol. Mass.:
39690.94
Organism:
Homo sapiens (Human)
Description:
P34972
Residue:
360
  
Inhibitor
Name:
BDBM50213151
Synonyms:
6-(2-hydroxy-3',5'-dimethyl-biphenyl-4-yl)-6-methyl-heptanoic acid methyl ester | CHEMBL233637
Type:
Small organic molecule
Emp. Form.:
C23H30O3
Mol. Mass.:
354.4825
SMILES:
COC(=O)CCCCC(C)(C)c1ccc(c(O)c1)-c1cc(C)cc(C)c1
: