Target
Cannabinoid receptor 1
Ligand
BDBM50213164
Substrate
Meas. Tech.
ChEMBL_447433 (CHEMBL896457)
Ki
1.8±n/a nM
Citation
 Worm, KZhou, QJStabley, GJDeHaven, RNDolle, RE Biaryl cannabinoid mimetics--synthesis and structure-activity relationship. Bioorg Med Chem Lett 17:3652-6 (2007)  
Target
Name:
Cannabinoid receptor 1
Synonyms:
CANN6 CB-R CNR CNR1_HUMAN Cannabinoid receptor Cannabinoid receptor 1 (brain)
Type:
G Protein-Coupled Receptor (GPCR)
Mol. Mass.:
52868.96
Organism:
Homo sapiens (Human)
Description:
P21554
Residue:
472
  
Inhibitor
Name:
BDBM50213164
Synonyms:
4-(1-hexyl-cyclohexyl)-3',5'-dimethyl-biphenyl-2-ol | CHEMBL233636
Type:
Small organic molecule
Emp. Form.:
C26H36O
Mol. Mass.:
364.5634
SMILES:
CCCCCCC1(CCCCC1)c1ccc(c(O)c1)-c1cc(C)cc(C)c1
: