Target
Cannabinoid receptor 2
Ligand
BDBM50213167
Substrate
Meas. Tech.
ChEMBL_447434 (CHEMBL896458)
Ki
20±n/a nM
Citation
 Worm, KZhou, QJStabley, GJDeHaven, RNDolle, RE Biaryl cannabinoid mimetics--synthesis and structure-activity relationship. Bioorg Med Chem Lett 17:3652-6 (2007)  
Target
Name:
Cannabinoid receptor 2
Synonyms:
CANNABINOID CB2 CB2 CB2B CNR2_HUMAN Cannabinoid CB2 receptor Cannabinoid receptor 2 (CB2R) | hCB2
Type:
G Protein-Coupled Receptor (GPCR)
Mol. Mass.:
39690.94
Organism:
Homo sapiens (Human)
Description:
P34972
Residue:
360
  
Inhibitor
Name:
BDBM50213167
Synonyms:
4-(1,1-dimethyl-heptyl)-2',3'-dimethyl-biphenyl-2-ol | CHEMBL391134
Type:
Small organic molecule
Emp. Form.:
C23H32O
Mol. Mass.:
324.4996
SMILES:
CCCCCCC(C)(C)c1ccc(c(O)c1)-c1cccc(C)c1C
: