Target
Cannabinoid receptor 1
Ligand
BDBM50213148
Substrate
Meas. Tech.
ChEMBL_447433 (CHEMBL896457)
Ki
230±n/a nM
Citation
 Worm, KZhou, QJStabley, GJDeHaven, RNDolle, RE Biaryl cannabinoid mimetics--synthesis and structure-activity relationship. Bioorg Med Chem Lett 17:3652-6 (2007)  
Target
Name:
Cannabinoid receptor 1
Synonyms:
CANN6 CB-R CNR CNR1_HUMAN Cannabinoid receptor Cannabinoid receptor 1 (brain)
Type:
G Protein-Coupled Receptor (GPCR)
Mol. Mass.:
52868.96
Organism:
Homo sapiens (Human)
Description:
P21554
Residue:
472
  
Inhibitor
Name:
BDBM50213148
Synonyms:
4-(1,1-dimethyl-heptyl)-3',5'-dimethyl-biphenyl-2-carboxylic acid methyl ester | CHEMBL233180
Type:
Small organic molecule
Emp. Form.:
C25H34O2
Mol. Mass.:
366.5363
SMILES:
CCCCCCC(C)(C)c1ccc(-c2cc(C)cc(C)c2)c(c1)C(=O)OC
: