Target
Cannabinoid receptor 1
Ligand
BDBM50213175
Substrate
Meas. Tech.
ChEMBL_447433 (CHEMBL896457)
Ki
39±n/a nM
Citation
 Worm, KZhou, QJStabley, GJDeHaven, RNDolle, RE Biaryl cannabinoid mimetics--synthesis and structure-activity relationship. Bioorg Med Chem Lett 17:3652-6 (2007)  
Target
Name:
Cannabinoid receptor 1
Synonyms:
CANN6 CB-R CNR CNR1_HUMAN Cannabinoid receptor Cannabinoid receptor 1 (brain)
Type:
G Protein-Coupled Receptor (GPCR)
Mol. Mass.:
52868.96
Organism:
Homo sapiens (Human)
Description:
P21554
Residue:
472
  
Inhibitor
Name:
BDBM50213175
Synonyms:
4-(6-hydroxy-1,1-dimethyl-hexyl)-3',5'-dimethyl-biphenyl-2-ol | CHEMBL234675
Type:
Small organic molecule
Emp. Form.:
C22H30O2
Mol. Mass.:
326.4724
SMILES:
Cc1cc(C)cc(c1)-c1ccc(cc1O)C(C)(C)CCCCCO
: