Target
Cannabinoid receptor 2
Ligand
BDBM50213162
Substrate
Meas. Tech.
ChEMBL_447434 (CHEMBL896458)
Ki
34±n/a nM
Citation
 Worm, KZhou, QJStabley, GJDeHaven, RNDolle, RE Biaryl cannabinoid mimetics--synthesis and structure-activity relationship. Bioorg Med Chem Lett 17:3652-6 (2007)  
Target
Name:
Cannabinoid receptor 2
Synonyms:
CANNABINOID CB2 CB2 CB2B CNR2_HUMAN Cannabinoid CB2 receptor Cannabinoid receptor 2 (CB2R) | hCB2
Type:
G Protein-Coupled Receptor (GPCR)
Mol. Mass.:
39690.94
Organism:
Homo sapiens (Human)
Description:
P34972
Residue:
360
  
Inhibitor
Name:
BDBM50213162
Synonyms:
4-(1,1-dimethyl-heptyl)-2-methoxy-3',5'-dimethyl-biphenyl | CHEMBL234209
Type:
Small organic molecule
Emp. Form.:
C24H34O
Mol. Mass.:
338.5262
SMILES:
CCCCCCC(C)(C)c1ccc(c(OC)c1)-c1cc(C)cc(C)c1
: