Target
Cannabinoid receptor 2
Ligand
BDBM50213175
Substrate
Meas. Tech.
ChEMBL_447434 (CHEMBL896458)
Ki
3.6±n/a nM
Citation
 Worm, KZhou, QJStabley, GJDeHaven, RNDolle, RE Biaryl cannabinoid mimetics--synthesis and structure-activity relationship. Bioorg Med Chem Lett 17:3652-6 (2007)  
Target
Name:
Cannabinoid receptor 2
Synonyms:
CANNABINOID CB2 CB2 CB2B CNR2_HUMAN Cannabinoid CB2 receptor Cannabinoid receptor 2 (CB2R) | hCB2
Type:
G Protein-Coupled Receptor (GPCR)
Mol. Mass.:
39690.94
Organism:
Homo sapiens (Human)
Description:
P34972
Residue:
360
  
Inhibitor
Name:
BDBM50213175
Synonyms:
4-(6-hydroxy-1,1-dimethyl-hexyl)-3',5'-dimethyl-biphenyl-2-ol | CHEMBL234675
Type:
Small organic molecule
Emp. Form.:
C22H30O2
Mol. Mass.:
326.4724
SMILES:
Cc1cc(C)cc(c1)-c1ccc(cc1O)C(C)(C)CCCCCO
: